{"text_format":"1","workbook":"xlsx","n_sheets":3,"sheets":["Fund ID Set Up - OLD","Fund ID Set Up","DROPDOWN"],"not_rendered":{"charts":0,"images":0,"macros":0,"external_links":0,"defined_names":2,"comments":0,"pivot_tables":0},"unopened":[],"bounds":{"document_bytes":16777216,"sheet_cells":100000,"rows_first":2000,"rows_last":500,"rows_between":2000,"halvings":0,"cell_chars":16384,"cell_head_chars":4096},"cells_cut":0,"cells_raw":0,"read":"whole","date_system":"1900"}

{"sheet":"Fund ID Set Up - OLD","index":0,"n_rows":40,"n_cols":31,"rows_kept":40,"cut":false,"hidden":true,"merged":[[0,0,0,30],[1,0,1,30],[2,0,2,30],[5,5,5,10],[21,6,21,7],[9,7,9,21],[13,23,13,26],[5,13,5,15],[15,4,15,20],[15,23,15,26],[17,23,17,26],[5,18,5,19],[5,23,5,25],[13,4,13,20],[5,28,5,29],[7,3,7,28],[30,27,30,30],[11,2,11,29],[15,29,15,30],[13,29,13,30],[23,6,23,7],[20,4,20,7],[24,8,24,9],[17,4,17,20],[27,18,27,22],[26,13,26,17],[17,29,17,30],[22,6,22,7]]}
["HUMBOLDT STATE UNIVERSITY "]
["PeopleSoft Chartfield"]
["FUND/PROJECT ID SET UP/CHANGE"]
[null,null,null,null,"Business Unit:",null,null,null,null,null,null,null,null,null,null,null,null,null,null,null,"HMCMP",null,null,null,null,"HMADV",null,null,null,"HMSPF","X"]
[]
["Effective Date:",null,null,null,null,"2010-07-01",null,null,null,null,null,null,null,"Status:",null,null,null,null,"New",null,null,"X",null,"Change",null,null,null,null,"Inactivate"]
[]
["Desc(30):",null,null,null,null,null,null,null,null,null,null,null,null,null,null,null,null,null,null,null,null,null,null,null,null,null,null,null,null,{"$f":"LEN(D8)","v":0}]
[]
["Short Description(10):",null,null,null,null,null,null,null,null,null,null,null,null,null,null,null,null,null,null,null,null,null,{"$f":"LEN(H10)","v":0}]
[]
["Purpose:",null,"TO TRACK AWARD ACTIVITY"]
[]
["Requested By:",null,null,null,null,null,null,null,null,null,null,null,null,null,null,null,null,null,null,null,null,null,"Date:",null,null,null,null,null,"Phone: "]
[]
["Authorized By:",null,null,null,"MIKE BURGHART, ACCOUNTANT II",null,null,null,null,null,null,null,null,null,null,null,null,null,null,null,null,null,"Date:",null,null,null,null,null,"Phone: ","x5780"]
[]
["Processed By:",null,null,null,"CINDY HORI, ACCOUNTANT I",null,null,null,null,null,null,null,null,null,null,null,null,null,null,null,null,null,"Date:",null,null,null,null,null,"Phone: ","x5788"]
[]
[]
["FNAT Key",null,null,null,129487]
["CSU Fund Code",null,null,null,null,null,932]
["SCO Fund",null,null,null,null,null,"0994"]
["SCO Sub-Fund",null,null,null,null,null,"000"]
["Fund processing type",null,null,null,null,null,null,null,4100]
["Reimbursed",null,null,null,null,"Yes",null,null,null,"No",null,"X"]
[null,"Reimbursement Account #"]
[null,"Trust - Target Fund for Interest Allocation"]
[]
["THIS SECTION FOR FISCAL SERVICES USE ONLY."]
["PS Fund assigned:",null,null,null,null,null,null,null,null,null,null,null,null,null,null,null,null,null,null,null,null,null,"Project End Date:"]
[]
["PS Project assigned:"]
[]
["Add to File Folder T: Drive"]
[]
["When Complete:"]
[null,"Original to COA Changes Log",null,null,null,null,null,null,null,null,null,null,null,null,null,null,null,null,"Other Copies to"]
[null,"Copy to Budget"]
[null,"Copy to Requester"]

{"sheet":"Fund ID Set Up","index":1,"n_rows":51,"n_cols":31,"rows_kept":51,"cut":false,"hidden":false,"merged":[[27,23,27,26],[27,29,27,30],[39,6,39,17],[23,4,23,20],[23,23,23,26],[23,29,23,30],[25,4,25,20],[25,23,25,26],[25,29,25,30],[29,23,29,26],[29,29,29,30],[31,23,31,26],[31,29,31,30],[50,18,50,22],[44,6,44,7],[45,6,45,7],[46,6,46,7],[27,4,27,20],[47,8,47,9],[49,13,49,17],[43,4,43,7],[29,4,29,20],[31,4,31,20],[4,12,4,15],[17,4,17,30],[21,4,21,28],[13,22,13,28],[0,0,0,30],[1,0,1,30],[2,0,2,30],[6,13,6,15],[6,18,6,19],[6,23,6,25],[8,4,8,29],[6,4,6,10],[19,4,19,30],[13,4,13,12],[10,4,10,19],[15,4,15,30]]}
["HUMBOLDT STATE UNIVERSITY "]
["PeopleSoft Chartfield"]
["FUND/PROJECT ID SET UP/CHANGE"]
[]
[null,null,null,null,"Business Unit:",null,null,null,null,null,null,null,"HMSPF"]
[]
["Effective Date",null,null,null,"2011-07-01",null,null,null,null,null,null,null,null,"Status:",null,null,null,null,"New",null,null,"X",null,"Change",null,null,null,null,null,"Inactivate"]
[]
["Description [30]",null,null,null,null,null,null,null,null,null,null,null,null,null,null,null,null,null,null,null,null,null,null,null,null,null,null,null,null,null,{"$f":"LEN(E9)","v":0}]
[]
["Short Description [10]",null,null,null,null,null,null,null,null,null,null,null,null,null,null,null,null,null,null,null,{"$f":"LEN(E11)","v":0},null,"Federal",null,null,null,"Local",null,null,"Other"]
[null,null,null,null,null,null,null,null,null,null,null,null,null,null,null,null,null,null,null,null,null,null,"State",null,null,null,"Corporate"]
[]
["Project Start Date",null,null,null,null,null,null,null,null,null,null,null,null,null,null,null,null,"Project End Date"]
[]
["Funder"]
[]
["P.I./Secondary Contact"]
[]
["Purpose",null,null,null,"To track award activity"]
[]
["PROGRAM_CD Attribute"]
[]
["Requested By:",null,null,null,null,null,null,null,null,null,null,null,null,null,null,null,null,null,null,null,null,null,"Date:",null,null,null,null,null,"Phone: "]
[]
["Review By:",null,null,null,null,null,null,null,null,null,null,null,null,null,null,null,null,null,null,null,null,null,"Date:",null,null,null,null,null,"Phone: "]
[]
["Budget Office Approval:",null,null,null,null,null,null,null,null,null,null,null,null,null,null,null,null,null,null,null,null,null,"Date:",null,null,null,null,null,"Phone: "]
[]
["Accounting Approval:",null,null,null,null,null,null,null,null,null,null,null,null,null,null,null,null,null,null,null,null,null,"Date:",null,null,null,null,null,"Phone: "]
[]
["Bus. Srvcs. AVP Approval:",null,null,null,null,null,null,null,null,null,null,null,null,null,null,null,null,null,null,null,null,null,"Date:",null,null,null,null,null,"Phone: "]
[]
["THIS SECTION FOR FISCAL SERVICES USE ONLY."]
[]
["PS Fund assigned:",null,null,null,null,null,null,null,null,null,null,null,null,null,null,null,null,null,null,null,null,"Add to File Folder T: Drive"]
[]
["PS Project assigned:",null,null,null,null,null,{"$f":"G36","v":0},null,0,null,{"$f":"I36","v":0},null,{"$f":"K36","v":0},null,{"$f":"M36","v":0},null,null,{"$f":"O36","v":0},null,null,null,"Add to APEX database"]
[]
["FUND_CLASSFIC Attribute",null,null,null,null,null,null,null,null,null,null,null,null,null,null,null,null,null,null,null,null,"Add FUND_PROJ Combo Edit"]
[]
[null,null,null,null,null,"Copy to Contracts & Risk Mgmt",null,null,null,null,null,null,null,null,null,null,null,null,null,null,null,"Original to COA Changes Log"]
[]
["FNAT Key",null,null,null,129487]
["CSU Fund Code",null,null,null,null,null,{"$f":"VLOOKUP(E44,DROPDOWN!$D$8:$H$9,2,FALSE)","v":932}]
["SCO Fund",null,null,null,null,null,{"$f":"VLOOKUP(E44,DROPDOWN!$D$8:$H$9,3,FALSE)","v":"0994"}]
["SCO Sub-Fund",null,null,null,null,null,{"$f":"VLOOKUP(E44,DROPDOWN!$D$8:$H$9,4,FALSE)","v":"000"}]
["Fund processing type",null,null,null,null,null,null,null,{"$f":"VLOOKUP(E44,DROPDOWN!$D$8:$H$9,5,FALSE)","v":4100}]
["Reimbursed",null,null,null,null,"Yes",null,null,null,"No",null,"X"]
[null,"Reimbursement Account #"]
[null,"Trust - Target Fund for Interest Allocation"]

{"sheet":"DROPDOWN","index":2,"n_rows":21,"n_cols":8,"rows_kept":21,"cut":false,"hidden":false,"merged":[]}
[null,"FNAT"]
[null,129487,"Auxiliary Org-Restricted Expendable-Reseacrh"]
[null,129492,"Aux Org-Unrestricted Non-Aux Enterprise/Non-Student Service"]
[]
[]
[]
[null,null,null,null,"CSU","SCO","SCO Sub","Fund Proc"]
[null,null,null,129487,932,"0994","000",4100]
[null,null,null,129492,981,"0994","000",4100]
[]
[null,"Fund Attribute","GASB Type"]
[null,"GENERAL OPERATIONS","0100 - INSTRUCTION"]
[null,"PLANT ","0200 - RESEARCH"]
[null,"SMALL GRANTS","0300 - PUBLIC SERVICE"]
[null,"GRANTS & CONTRACTS","0400 - ACADEMIC SUPPORT"]
[null,"PI TRUSTS","0500 - STUDENT SERVICES"]
[null,"CAMPUS TRUSTS","0600 - INSTITUTIONAL SUPPORT"]
[null,null,"0700 - PLANT"]
[null,null,"0800 - SCHOLARSHIPS AND FELLOWSHIPS"]
[null,null,"1200 - DEPRECIATION"]
[null,null,"2000 - AUXILLIARY EXPENSES"]